Reaction Details
TargetKappa-type opioid receptor
LigandBDBM50160838
Substrate/Competitorn/a
Meas. Tech.ChEMBL_303046 (CHEMBL828016)
Ki 0.63±n/a nM
Citation Kumar, VGuo, DCassel, JADaubert, JDDehaven, RNDehaven-Hudkins, DLGauntner, EKGottshall, SLGreiner, SLKoblish, MLittle, PJMansson, EMaycock, AL Synthesis and evaluation of novel peripherally restricted kappa-opioid receptor agonists. Bioorg Med Chem Lett15:1091-5 (2005) 
 
Kappa-type opioid receptor
Name:Kappa-type opioid receptor
Type:G Protein-Coupled Receptor (GPCR)
Mol. Mass.:42648.76
Organism:Homo sapiens (Human)
Description:P41145
Residue:380
BDBM50160838
NameBDBM50160838
Synonyms:CHEMBL365198 | N-Methyl-N-[(S)-1-(3-nitro-phenyl)-2-pyrrolidin-1-yl-ethyl]-2-(4-trifluoromethyl-phenyl)-acetamide
TypeSmall organic molecule
Emp. Form.C22H24F3N3O3
Mol. Mass.435.4395
SMILESCN([C@H](CN1CCCC1)c1cccc(c1)[N+]([O-])=O)C(=O)Cc1ccc(cc1)C(F)(F)F