Reaction Details
TargetHistamine H1 receptor
LigandBDBM50156880
Substrate/Competitorn/a
Meas. Tech.ChEMBL_305389 (CHEMBL833040)
IC50 330±n/a nM
Citation Fonquerna, SMiralpeix, MPagès, LPuig, CCardús, AAntón, FVilella, DAparici, MPrieto, JWarrellow, GBeleta, JRyder, H Synthesis and structure-activity relationships of piperidinylpyrrolopyridine derivatives as potent and selective H1 antagonists. Bioorg Med Chem Lett15:1165-7 (2005) 
 
Histamine H1 receptor
Name:Histamine H1 receptor
Type:G Protein-Coupled Receptor (GPCR)
Mol. Mass.:55641.53
Organism:Cavia porcellus (domestic guinea pig)
Description:Guinea pig cerebellum was used in binding assay.
Residue:488
BDBM50156880
NameBDBM50156880
Synonyms:3-{4-[1-(5-Chloro-thiophen-2-ylmethyl)-1H-indol-3-yl]-piperidin-1-ylmethyl}-benzoic acid CHEMBL185489
TypeSmall organic molecule
Emp. Form.C26H25ClN2O2S
Mol. Mass.465.007
SMILESOC(=O)c1cccc(CN2CCC(CC2)c2cn(Cc3ccc(Cl)s3)c3ccccc23)c1