Reaction Details
TargetC-C chemokine receptor type 3
LigandBDBM50161438
Substrate/Competitorn/a
Meas. Tech.ChEMBL_303259 (CHEMBL826385)
Ki 68±n/a nM
Citation Ting, PCLee, JFWu, JUmland, SPAslanian, RCao, JDong, YGarlisi, CGGilbert, EJHuang, YJakway, JKelly, JLiu, ZMcCombie, SShah, HTian, FWan, YShih, NY The synthesis of substituted bipiperidine amide compounds as CCR3 antagonists. Bioorg Med Chem Lett15:1375-8 (2005) 
 
C-C chemokine receptor type 3
Name:C-C chemokine receptor type 3
Type:Enzyme
Mol. Mass.:41053.88
Organism:Homo sapiens (Human)
Description:P51677
Residue:355
BDBM50161438
NameBDBM50161438
Synonyms:CHEMBL178875 | [4-(3,4-Dichloro-benzyl)-[1,4'']bipiperidinyl-1''-yl]-quinolin-8-yl-methanone
TypeSmall organic molecule
Emp. Form.C27H29Cl2N3O
Mol. Mass.482.445
SMILESClc1ccc(CC2CCN(CC2)C2CCN(CC2)C(=O)c2cccc3cccnc23)cc1Cl