Reaction Details
TargetCannabinoid receptor 1
LigandBDBM50161560
Substrate/Competitorn/a
Meas. Tech.ChEMBL_306671 (CHEMBL832272)
IC50 500±n/a nM
Citation Plummer, CWFinke, PEMills, SGWang, JTong, XDoss, GAFong, TMLao, JZSchaeffer, MTChen, JShen, CPStribling, DSShearman, LPStrack, AMVan der Ploeg, LH Synthesis and activity of 4,5-diarylimidazoles as human CB1 receptor inverse agonists. Bioorg Med Chem Lett15:1441-6 (2005) 
 
Cannabinoid receptor 1
Name:Cannabinoid receptor 1
Type:G Protein-Coupled Receptor (GPCR)
Mol. Mass.:52868.96
Organism:Homo sapiens (Human)
Description:P21554
Residue:472
BDBM50161560
NameBDBM50161560
Synonyms:4,5-Bis-(4-chloro-phenyl)-oxazole-2-carboxylic acid cyclohexylamide | CHEMBL179324
TypeSmall organic molecule
Emp. Form.C22H20Cl2N2O2
Mol. Mass.415.312
SMILESClc1ccc(cc1)-c1nc(oc1-c1ccc(Cl)cc1)C(=O)NC1CCCCC1