Reaction Details
TargetCannabinoid receptor 1
LigandBDBM50161572
Substrate/Competitorn/a
Meas. Tech.ChEMBL_306671 (CHEMBL832272)
IC50 4±n/a nM
Citation Plummer, CWFinke, PEMills, SGWang, JTong, XDoss, GAFong, TMLao, JZSchaeffer, MTChen, JShen, CPStribling, DSShearman, LPStrack, AMVan der Ploeg, LH Synthesis and activity of 4,5-diarylimidazoles as human CB1 receptor inverse agonists. Bioorg Med Chem Lett15:1441-6 (2005) 
 
Cannabinoid receptor 1
Name:Cannabinoid receptor 1
Type:G Protein-Coupled Receptor (GPCR)
Mol. Mass.:52868.96
Organism:Homo sapiens (Human)
Description:P21554
Residue:472
BDBM50161572
NameBDBM50161572
Synonyms:5-(4-Chloro-phenyl)-4-(2,4-dichloro-phenyl)-1-methyl-1H-imidazole-2-carboxylic acid cyclohexylamide | CHEMBL179473
TypeSmall organic molecule
Emp. Form.C23H22Cl3N3O
Mol. Mass.462.799
SMILESCn1c(nc(c1-c1ccc(Cl)cc1)-c1ccc(Cl)cc1Cl)C(=O)NC1CCCCC1