Reaction Details
Target5-hydroxytryptamine receptor 7
LigandBDBM50305263
Substrate/Competitorn/a
Meas. Tech.ChEMBL_2196596 (CHEMBL5109112)
Ki 0.153±n/a nM
Citation Sang, ZWang, KDong, JTang, L Alzheimer's disease: Updated multi-targets therapeutics are in clinical and in progress. Eur J Med Chem238:0 (2022) 
 
5-hydroxytryptamine receptor 7
Name:5-hydroxytryptamine receptor 7
Type:G Protein-Coupled Receptor (GPCR)
Mol. Mass.:53573.08
Organism:Homo sapiens (Human)
Description:P34969
Residue:479
BDBM50305263
NameBDBM50305263
Synonyms:2,8-Dimethyl-5-phenethyl-2,3,4,5-tetrahydro-1H-pyrido[4,3-b]indole | CHEMBL592752
TypeSmall organic molecule
Emp. Form.C21H24N2
Mol. Mass.304.4287
SMILESCN1CCc2c(C1)c1cc(C)ccc1n2CCc1ccccc1