Reaction Details
TargetMelanin-concentrating hormone receptor 1
LigandBDBM50162116
Substrate/Competitorn/a
Meas. Tech.ChEMBL_306651 (CHEMBL832988)
IC50 1.4±n/a nM
Citation Souers, AJGao, JBrune, MBush, EWodka, DVasudevan, AJudd, ASMulhern, MBrodjian, SDayton, BShapiro, RHernandez, LEMarsh, KCSham, HLCollins, CAKym, PR Identification of 2-(4-benzyloxyphenyl)-N- [1-(2-pyrrolidin-1-yl-ethyl)-1H-indazol-6-yl]acetamide, an orally efficacious melanin-concentrating hormone receptor 1 antagonist for the treatment of obesity. J Med Chem48:1318-21 (2005) 
 
Melanin-concentrating hormone receptor 1
Name:Melanin-concentrating hormone receptor 1
Type:G Protein-Coupled Receptor (GPCR)
Mol. Mass.:45976.27
Organism:Homo sapiens (Human)
Description:Membranes from CHO-K1 cells stably expressing human MCH1R were used in assays.
Residue:422
BDBM50162116
NameBDBM50162116
Synonyms:2-(4-(benzyloxy)phenyl)-N-(1-(2-(pyrrolidin-1-yl)ethyl)-1H-indazol-6-yl)acetamide CHEMBL179501
TypeSmall organic molecule
Emp. Form.C28H30N4O2
Mol. Mass.454.5634
SMILESO=C(Cc1ccc(OCc2ccccc2)cc1)Nc1ccc2cnn(CCN3CCCC3)c2c1