Reaction Details
TargetSigma non-opioid intracellular receptor 1
LigandBDBM50581508
Substrate/Competitorn/a
Meas. Tech.ChEMBL_2197773 (CHEMBL5110289)
Ki 4.3±n/a nM
Citation Zhuang, TXiong, JRen, XLiang, LQi, ZZhang, SDu, WChen, YLiu, XZhang, G Benzylaminofentanyl derivates: Discovery of bifunctional ? opioid and ? Eur J Med Chem241:0 (2022) 
 
Sigma non-opioid intracellular receptor 1
Name:Sigma non-opioid intracellular receptor 1
Type:Protein
Mol. Mass.:25307.17
Organism:Cavia porcellus (Guinea pig)
Description:Q60492
Residue:223
BDBM50581508
NameBDBM50581508
Synonyms:CHEMBL5087973
TypeSmall organic molecule
Emp. Form.C24H32N2O
Mol. Mass.364.5237
SMILESCCC(=O)N(C[C@H](C)N1CCC(Cc2ccccc2)CC1)c1ccccc1