Reaction Details
TargetMu-type opioid receptor
LigandBDBM50564193
Substrate/Competitorn/a
Meas. Tech.ChEMBL_2197774 (CHEMBL5110290)
Ki 1.9±n/a nM
Citation Zhuang, TXiong, JRen, XLiang, LQi, ZZhang, SDu, WChen, YLiu, XZhang, G Benzylaminofentanyl derivates: Discovery of bifunctional ? opioid and ? Eur J Med Chem241:0 (2022) 
 
Mu-type opioid receptor
Name:Mu-type opioid receptor
Type:G Protein-Coupled Receptor (GPCR)
Mol. Mass.:44789.51
Organism:Homo sapiens (Human)
Description:P35372
Residue:400
BDBM50564193
NameBDBM50564193
Synonyms:CHEMBL4789321
TypeSmall organic molecule
Emp. Form.C24H31FN2O2
Mol. Mass.398.5135
SMILESCCC(=O)N(CCN1CCC(Cc2ccc(F)cc2)CC1)c1ccc(OC)cc1