Reaction Details
TargetCytochrome P450 26A1
LigandBDBM50176808
Substrate/Competitorn/a
Meas. Tech.ChEMBL_305304 (CHEMBL832851)
IC50 6000±n/a nM
Citation Mulvihill, MJKan, JLBeck, PBittner, MCesario, CCooke, AKeane, DMNigro, AINillson, CSmith, VSrebernak, MSun, FLVrkljan, MWinski, SLCastelhano, ALEmerson, DGibson, N Potent and selective [2-imidazol-1-yl-2-(6-alkoxy-naphthalen-2-yl)-1-methyl-ethyl]-dimethyl-amines as retinoic acid metabolic blocking agents (RAMBAs). Bioorg Med Chem Lett15:1669-73 (2005) 
 
Cytochrome P450 26A1
Name:Cytochrome P450 26A1
Type:Enzyme
Mol. Mass.:56216.16
Organism:Homo sapiens (Human)
Description:O43174
Residue:497
BDBM50176808
NameBDBM50176808
Synonyms:5-[(3-Chloro-phenyl)-imidazol-1-yl-methyl]-1H-benzoimidazole CHEMBL389433 US9144538, Liarizole hydrochloride | liarozole
TypeSmall organic molecule
Emp. Form.C17H13ClN4
Mol. Mass.308.765
SMILESClc1cccc(c1)C(c1ccc2nc[nH]c2c1)n1ccnc1