Reaction Details
Target5-hydroxytryptamine receptor 6
LigandBDBM50163052
Substrate/Competitorn/a
Meas. Tech.ChEMBL_303258 (CHEMBL826384)
Ki 1.9±n/a nM
Citation Holenz, JMercè, RDíaz, JLGuitart, XCodony, XDordal, ARomero, GTorrens, AMas, JAndaluz, BHernández, SMonroy, XSánchez, EHernández, EPérez, RCubí, RSanfeliu, OBuschmann, H Medicinal chemistry driven approaches toward novel and selective serotonin 5-HT6 receptor ligands. J Med Chem48:1781-95 (2005) 
 
5-hydroxytryptamine receptor 6
Name:5-hydroxytryptamine receptor 6
Type:G Protein-Coupled Receptor (GPCR)
Mol. Mass.:46968.43
Organism:Homo sapiens (Human)
Description:P50406
Residue:440
BDBM50163052
NameBDBM50163052
Synonyms:6-Chloro-imidazo[2,1-b]thiazole-5-sulfonic acid [1-(2-dimethylamino-ethyl)-1H-indol-5-yl]-amide | CHEMBL175940
TypeSmall organic molecule
Emp. Form.C17H18ClN5O2S2
Mol. Mass.423.94
SMILESCN(C)CCn1ccc2cc(NS(=O)(=O)c3c(Cl)nc4sccn34)ccc12