Reaction Details
Target5-hydroxytryptamine receptor 6
LigandBDBM50163061
Substrate/Competitorn/a
Meas. Tech.ChEMBL_303258 (CHEMBL826384)
Ki 0.5±n/a nM
Citation Holenz, JMercè, RDíaz, JLGuitart, XCodony, XDordal, ARomero, GTorrens, AMas, JAndaluz, BHernández, SMonroy, XSánchez, EHernández, EPérez, RCubí, RSanfeliu, OBuschmann, H Medicinal chemistry driven approaches toward novel and selective serotonin 5-HT6 receptor ligands. J Med Chem48:1781-95 (2005) 
 
5-hydroxytryptamine receptor 6
Name:5-hydroxytryptamine receptor 6
Type:G Protein-Coupled Receptor (GPCR)
Mol. Mass.:46968.43
Organism:Homo sapiens (Human)
Description:P50406
Residue:440
BDBM50163061
NameBDBM50163061
Synonyms:5-Chloro-3-methyl-benzo[b]thiophene-2-sulfonic acid [3-(2-dipropylamino-ethyl)-1H-indol-5-yl]-amide | CHEMBL179407
TypeSmall organic molecule
Emp. Form.C25H30ClN3O2S2
Mol. Mass.504.108
SMILESCCCN(CCC)CCc1c[nH]c2ccc(NS(=O)(=O)c3sc4ccc(Cl)cc4c3C)cc12