Reaction Details
TargetSerine/threonine-protein kinase Chk2
LigandBDBM50163246
Substrate/Competitorn/a
Meas. Tech.ChEMBL_305572 (CHEMBL874429)
IC50 3.4±n/a nM
Citation Arienti, KLBrunmark, AAxe, FUMcClure, KLee, ABlevitt, JNeff, DKHuang, LCrawford, SPandit, CRKarlsson, LBreitenbucher, JG Checkpoint kinase inhibitors: SAR and radioprotective properties of a series of 2-arylbenzimidazoles. J Med Chem48:1873-85 (2005) 
 
Serine/threonine-protein kinase Chk2
Name:Serine/threonine-protein kinase Chk2
Type:Protein
Mol. Mass.:60908.59
Organism:Homo sapiens (Human)
Description:O96017
Residue:543
BDBM50163246
NameBDBM50163246
Synonyms:2-[4-(3,4-Dichloro-phenylsulfamoyl)-phenyl]-1H-benzoimidazole-5-carboxylic acid amide | CHEMBL195177
TypeSmall organic molecule
Emp. Form.C20H14Cl2N4O3S
Mol. Mass.461.321
SMILESNC(=O)c1ccc2nc([nH]c2c1)-c1ccc(cc1)S(=O)(=O)Nc1ccc(Cl)c(Cl)c1