Reaction Details
TargetSerine/threonine-protein kinase Chk2
LigandBDBM50163266
Substrate/Competitorn/a
Meas. Tech.ChEMBL_305572 (CHEMBL874429)
IC50 5.5±n/a nM
Citation Arienti, KLBrunmark, AAxe, FUMcClure, KLee, ABlevitt, JNeff, DKHuang, LCrawford, SPandit, CRKarlsson, LBreitenbucher, JG Checkpoint kinase inhibitors: SAR and radioprotective properties of a series of 2-arylbenzimidazoles. J Med Chem48:1873-85 (2005) 
 
Serine/threonine-protein kinase Chk2
Name:Serine/threonine-protein kinase Chk2
Type:Protein
Mol. Mass.:60908.59
Organism:Homo sapiens (Human)
Description:O96017
Residue:543
BDBM50163266
NameBDBM50163266
Synonyms:2-[4-(3,4-Dichloro-phenoxy)-phenyl]-1H-benzoimidazole-5-carboxylic acid amide | CHEMBL175553
TypeSmall organic molecule
Emp. Form.C20H13Cl2N3O2
Mol. Mass.398.242
SMILESNC(=O)c1ccc2nc([nH]c2c1)-c1ccc(Oc2ccc(Cl)c(Cl)c2)cc1