Reaction Details
TargetSerine/threonine-protein kinase Chk2
LigandBDBM50163258
Substrate/Competitorn/a
Meas. Tech.ChEMBL_305572 (CHEMBL874429)
IC50 200±n/a nM
Citation Arienti, KLBrunmark, AAxe, FUMcClure, KLee, ABlevitt, JNeff, DKHuang, LCrawford, SPandit, CRKarlsson, LBreitenbucher, JG Checkpoint kinase inhibitors: SAR and radioprotective properties of a series of 2-arylbenzimidazoles. J Med Chem48:1873-85 (2005) 
 
Serine/threonine-protein kinase Chk2
Name:Serine/threonine-protein kinase Chk2
Type:Protein
Mol. Mass.:60908.59
Organism:Homo sapiens (Human)
Description:O96017
Residue:543
BDBM50163258
NameBDBM50163258
Synonyms:2-(4-Ethoxy-phenyl)-1H-benzoimidazole-5-carboxylic acid amide | CHEMBL175780
TypeSmall organic molecule
Emp. Form.C16H15N3O2
Mol. Mass.281.3092
SMILESCCOc1ccc(cc1)-c1nc2ccc(cc2[nH]1)C(N)=O