Reaction Details
TargetSerine/threonine-protein kinase Chk2
LigandBDBM50163269
Substrate/Competitorn/a
Meas. Tech.ChEMBL_305572 (CHEMBL874429)
IC50 13±n/a nM
Citation Arienti, KLBrunmark, AAxe, FUMcClure, KLee, ABlevitt, JNeff, DKHuang, LCrawford, SPandit, CRKarlsson, LBreitenbucher, JG Checkpoint kinase inhibitors: SAR and radioprotective properties of a series of 2-arylbenzimidazoles. J Med Chem48:1873-85 (2005) 
 
Serine/threonine-protein kinase Chk2
Name:Serine/threonine-protein kinase Chk2
Type:Protein
Mol. Mass.:60908.59
Organism:Homo sapiens (Human)
Description:O96017
Residue:543
BDBM50163269
NameBDBM50163269
Synonyms:2-[4-(4-Chloro-benzenesulfinyl)-phenyl]-1H-benzoimidazole-5-carboxylic acid amide | CHEMBL364978
TypeSmall organic molecule
Emp. Form.C20H14ClN3O2S
Mol. Mass.395.862
SMILESNC(=O)c1ccc2nc([nH]c2c1)-c1ccc(cc1)S(=O)c1ccc(Cl)cc1