Reaction Details
TargetSerine/threonine-protein kinase Chk2
LigandBDBM50163277
Substrate/Competitorn/a
Meas. Tech.ChEMBL_305572 (CHEMBL874429)
IC50 24±n/a nM
Citation Arienti, KLBrunmark, AAxe, FUMcClure, KLee, ABlevitt, JNeff, DKHuang, LCrawford, SPandit, CRKarlsson, LBreitenbucher, JG Checkpoint kinase inhibitors: SAR and radioprotective properties of a series of 2-arylbenzimidazoles. J Med Chem48:1873-85 (2005) 
 
Serine/threonine-protein kinase Chk2
Name:Serine/threonine-protein kinase Chk2
Type:Protein
Mol. Mass.:60908.59
Organism:Homo sapiens (Human)
Description:O96017
Residue:543
BDBM50163277
NameBDBM50163277
Synonyms:2-(4-p-Tolyloxy-phenyl)-1H-benzoimidazole-5-carboxylic acid amide | CHEMBL175879
TypeSmall organic molecule
Emp. Form.C21H17N3O2
Mol. Mass.343.3786
SMILESCc1ccc(Oc2ccc(cc2)-c2nc3ccc(cc3[nH]2)C(N)=O)cc1