Reaction Details
TargetCollagenase 3
LigandBDBM50163809
Substrate/Competitorn/a
Meas. Tech.ChEMBL_305127 (CHEMBL832423)
IC50 0.540000±n/a nM
Citation Blagg, JANoe, MCWolf-Gouveia, LAReiter, LALaird, ERChang, SPDanley, DEDowns, JTElliott, NCEskra, JDGriffiths, RJHardink, JRHaugeto, AIJones, CSLiras, JLLopresti-Morrow, LLMitchell, PGPandit, JRobinson, RPSubramanyam, CVaughn-Bowser, MLYocum, SA Potent pyrimidinetrione-based inhibitors of MMP-13 with enhanced selectivity over MMP-14. Bioorg Med Chem Lett15:1807-10 (2005) 
 
Collagenase 3
Name:Collagenase 3
Type:Enzyme
Mol. Mass.:53808.06
Organism:Homo sapiens (Human)
Description:P45452
Residue:471
BDBM50163809
NameBDBM50163809
Synonyms:5-Amino-3-(2-ethoxy-ethyl)-3-[4-(4-oxazol-5-yl-phenoxy)-phenoxy]-piperidine-2,4,6-trione | CHEMBL367133
TypeSmall organic molecule
Emp. Form.C24H23N3O7
Mol. Mass.465.4553
SMILESCCOCCC1(Oc2ccc(Oc3ccc(cc3)-c3cnco3)cc2)C(=O)NC(=O)C(N)C1=O