Reaction Details
TargetSerine/threonine-protein kinase ATR
LigandBDBM268079
Substrate/Competitorn/a
Meas. Tech.ChEMBL_2204847 (CHEMBL5117555)
Ki 7.0±n/a nM
Citation Gorecki, LMuthna, DMerdita, SAndrs, MKucera, THavelek, RMuckova, LKobrlova, TSoukup, JKrupa, PPrchal, LSoukup, ORoh, JRezacova, MKorabecny, J 7-Azaindole, 2,7-diazaindole, and 1H-pyrazole as core structures for novel anticancer agents with potential chemosensitizing properties. Eur J Med Chem240:0 (2022) 
 
Serine/threonine-protein kinase ATR
Name:Serine/threonine-protein kinase ATR
Type:Protein
Mol. Mass.:301404.58
Organism:Homo sapiens (Human)
Description:Q13535
Residue:2644
BDBM268079
NameBDBM268079
Synonyms:2-[(3R)-3-methylmorpholin-4-yl]-4-(1-methyl-1H-pyrazol-5-yl)-8-(1H-pyrazol-5-yl)-1,7-naphthyridine US11529356, Example 111 | US9549932, 111
TypeSmall organic molecule
Emp. Form.C20H21N7O
Mol. Mass.375.427
SMILESC[C@@H]1COCCN1c1cc(-c2ccnn2C)c2ccnc(-c3ccn[nH]3)c2n1