Reaction Details
TargetSerine/threonine-protein kinase ATR
LigandBDBM412060
Substrate/Competitorn/a
Meas. Tech.ChEMBL_2204847 (CHEMBL5117555)
Ki<0.200000±n/a nM
Citation Gorecki, LMuthna, DMerdita, SAndrs, MKucera, THavelek, RMuckova, LKobrlova, TSoukup, JKrupa, PPrchal, LSoukup, ORoh, JRezacova, MKorabecny, J 7-Azaindole, 2,7-diazaindole, and 1H-pyrazole as core structures for novel anticancer agents with potential chemosensitizing properties. Eur J Med Chem240:0 (2022) 
 
Serine/threonine-protein kinase ATR
Name:Serine/threonine-protein kinase ATR
Type:Protein
Mol. Mass.:301404.58
Organism:Homo sapiens (Human)
Description:Q13535
Residue:2644
BDBM412060
NameBDBM412060
Synonyms:2-amino-6-fluoro-N-[5-fluoro-4-[4-[4-(oxetan-3-yl)piperazine-1-carbonyl]-1-piperidyl]-3-pyridyl]pyrazolo pyrimidine-3-carboxamide US10787452, Compound I-G-32 US11370798, Cmpd. # I-G-32 | US20230271963, Compound I-G-32
TypeSmall organic molecule
Emp. Form.C25H29F2N9O3
Mol. Mass.541.5531
SMILESNc1nn2cc(F)cnc2c1C(=O)Nc1cncc(F)c1N1CCC(CC1)C(=O)N1CCN(CC1)C1COC1