Reaction Details
TargetProcathepsin L
LigandBDBM50165424
Substrate/Competitorn/a
Meas. Tech.ChEMBL_306561 (CHEMBL829136)
IC50 410±n/a nM
Citation Barrett, DGCatalano, JGDeaton, DNLong, STMcFadyen, RBMiller, ABMiller, LRWells-Knecht, KJWright, LL A structural screening approach to ketoamide-based inhibitors of cathepsin K. Bioorg Med Chem Lett15:2209-13 (2005) 
 
Procathepsin L
Name:Procathepsin L
Type:Enzyme
Mol. Mass.:37557.19
Organism:Homo sapiens (Human)
Description:Purchased from Calbiochem (San Diego, CA).
Residue:333
BDBM50165424
NameBDBM50165424
Synonyms:(S)-4,4-dimethyl-2-oxo-tetrahydrofuran-3-yl (S)-1,2-dioxo-1-((R)-1-phenylethylamino)heptan-3-ylcarbamate [(S)-1-((R)-1-Phenyl-ethylaminooxalyl)-pentyl]-carbamic acid (S)-4,4-dimethyl-2-oxo-tetrahydro-furan-3-yl ester
TypeSmall organic molecule
Emp. Form.C22H30N2O6
Mol. Mass.418.4834
SMILESCCCC[C@H](NC(=O)O[C@@H]1C(=O)OCC1(C)C)C(=O)C(=O)N[C@H](C)c1ccccc1