Reaction Details
TargetProstacyclin receptor
LigandBDBM50165949
Substrate/Competitorn/a
Meas. Tech.ChEMBL_303131 (CHEMBL828948)
Ki>3000±n/a nM
Citation Hattori, KTanaka, AFujii, NTakasugi, HTenda, YTomita, MNakazato, SNakano, KKato, YKono, YMurai, HSakane, K Discovery of diphenyloxazole and Ndelta-Z-ornithine derivatives as highly potent and selective human prostaglandin EP(4) receptor antagonists. J Med Chem48:3103-6 (2005) 
 
Prostacyclin receptor
Name:Prostacyclin receptor
Type:G Protein-Coupled Receptor (GPCR)
Mol. Mass.:40968.22
Organism:Homo sapiens (Human)
Description:The membranes prepared from human platelet were used in binding assay.
Residue:386
BDBM50165949
NameBDBM50165949
Synonyms:C-Phenyl-N-{3-[2-((S)-5-phenyl-4-phenyl-oxazol-2-yl)-cyclohex-2-enylmethyl]-benzoyl}-methanesulfonamide | CHEMBL191638
TypeSmall organic molecule
Emp. Form.C36H32N2O4S
Mol. Mass.588.715
SMILESO=C(NS(=O)(=O)Cc1ccccc1)c1cccc(C[C@@H]2CCCC=C2c2nc(c(o2)-c2ccccc2)-c2ccccc2)c1