Reaction Details
TargetHistone deacetylase 3
LigandBDBM50593116
Substrate/Competitorn/a
Meas. Tech.ChEMBL_2207088 (CHEMBL5119796)
Ki 430±n/a nM
Citation Yue, KSun, SJia, GQin, MHou, XChou, CJHuang, CLi, X First-in-Class Hydrazide-Based HDAC6 Selective Inhibitor with Potent Oral Anti-Inflammatory Activity by Attenuating NLRP3 Inflammasome Activation. J Med Chem65:12140-12162 (2022) 
 
Histone deacetylase 3
Name:Histone deacetylase 3
Type:Enzyme
Mol. Mass.:48829.55
Organism:Homo sapiens (Human)
Description:O15379
Residue:428
BDBM50593116
NameBDBM50593116
Synonyms:CHEMBL5173493
TypeSmall organic molecule
Emp. Form.C23H22N4O
Mol. Mass.370.447
SMILESCCNNC(=O)c1ccc(CN2c3ccccc3C=Cc3ccncc23)cc1