Reaction Details
TargetGonadotropin-releasing hormone receptor
LigandBDBM50166443
Substrate/Competitorn/a
Meas. Tech.ChEMBL_303284 (CHEMBL828277)
Ki 2.6±n/a nM
Citation Guo, ZChen, YHuang, CQGross, TDPontillo, JRowbottom, MWSaunders, JStruthers, STucci, FCXie, QWade, WZhu, YFWu, DChen, C Uracils as potent antagonists of the human gonadotropin-releasing hormone receptor without atropisomers. Bioorg Med Chem Lett15:2519-22 (2005) 
 
Gonadotropin-releasing hormone receptor
Name:Gonadotropin-releasing hormone receptor
Type:Enzyme
Mol. Mass.:37749.45
Organism:Homo sapiens (Human)
Description:P30968
Residue:328
BDBM50166443
NameBDBM50166443
Synonyms:3-((R)-2-Amino-2-phenyl-ethyl)-5-(2-chloro-4-methyl-phenyl)-1-(2-fluoro-6-trifluoromethyl-benzyl)-1H-pyrimidine-2,4-dione | CHEMBL365561
TypeSmall organic molecule
Emp. Form.C27H22ClF4N3O2
Mol. Mass.531.929
SMILESCc1ccc(c(Cl)c1)-c1cn(Cc2c(F)cccc2C(F)(F)F)c(=O)n(C[C@H](N)c2ccccc2)c1=O