Reaction Details
TargetGonadotropin-releasing hormone receptor
LigandBDBM50166452
Substrate/Competitorn/a
Meas. Tech.ChEMBL_303284 (CHEMBL828277)
Ki 1.3±n/a nM
Citation Guo, ZChen, YHuang, CQGross, TDPontillo, JRowbottom, MWSaunders, JStruthers, STucci, FCXie, QWade, WZhu, YFWu, DChen, C Uracils as potent antagonists of the human gonadotropin-releasing hormone receptor without atropisomers. Bioorg Med Chem Lett15:2519-22 (2005) 
 
Gonadotropin-releasing hormone receptor
Name:Gonadotropin-releasing hormone receptor
Type:Enzyme
Mol. Mass.:37749.45
Organism:Homo sapiens (Human)
Description:P30968
Residue:328
BDBM50166452
NameBDBM50166452
Synonyms:(R)-1-(2-fluoro-6-(methylsulfonyl)benzyl)-3-(2-amino-2-phenylethyl)-5-(2-chlorophenyl)pyrimidine-2,4(1H,3H)-dione CHEMBL371613
TypeSmall organic molecule
Emp. Form.C26H23ClFN3O4S
Mol. Mass.527.995
SMILESCS(=O)(=O)c1cccc(F)c1Cn1cc(-c2ccccc2Cl)c(=O)n(C[C@H](N)c2ccccc2)c1=O