Reaction Details
TargetUDP-N-acetylenolpyruvoylglucosamine reductase
LigandBDBM50166484
Substrate/Competitorn/a
Meas. Tech.ChEMBL_304867 (CHEMBL829244)
IC50>50000±n/a nM
Citation Kutterer, KMDavis, JMSingh, GYang, YHu, WSeverin, ARasmussen, BAKrishnamurthy, GFailli, AKatz, AH 4-Alkyl and 4,4'-dialkyl 1,2-bis(4-chlorophenyl)pyrazolidine-3,5-dione derivatives as new inhibitors of bacterial cell wall biosynthesis. Bioorg Med Chem Lett15:2527-31 (2005) 
 
UDP-N-acetylenolpyruvoylglucosamine reductase
Name:UDP-N-acetylenolpyruvoylglucosamine reductase
Type:Protein
Mol. Mass.:33791.48
Organism:Staphylococcus aureus (Firmicutes)
Description:S. aureus MurB
Residue:307
BDBM50166484
NameBDBM50166484
Synonyms:1,2-Bis-(4-chloro-phenyl)-4-methyl-4-(6-phenyl-hexyl)-pyrazolidine-3,5-dione | CHEMBL189679
TypeSmall organic molecule
Emp. Form.C28H28Cl2N2O2
Mol. Mass.495.44
SMILESCC1(CCCCCCc2ccccc2)C(=O)N(N(C1=O)c1ccc(Cl)cc1)c1ccc(Cl)cc1