Reaction Details
TargetUDP-N-acetylenolpyruvoylglucosamine reductase
LigandBDBM50166478
Substrate/Competitorn/a
Meas. Tech.ChEMBL_304764 (CHEMBL829361)
IC50 8900±n/a nM
Citation Kutterer, KMDavis, JMSingh, GYang, YHu, WSeverin, ARasmussen, BAKrishnamurthy, GFailli, AKatz, AH 4-Alkyl and 4,4'-dialkyl 1,2-bis(4-chlorophenyl)pyrazolidine-3,5-dione derivatives as new inhibitors of bacterial cell wall biosynthesis. Bioorg Med Chem Lett15:2527-31 (2005) 
 
UDP-N-acetylenolpyruvoylglucosamine reductase
Name:UDP-N-acetylenolpyruvoylglucosamine reductase
Type:Protein
Mol. Mass.:37848.05
Organism:Escherichia coli K-12 (Enterobacteria)
Description:E. coli MurB
Residue:342
BDBM50166478
NameBDBM50166478
Synonyms:1,2-Bis-(4-chloro-phenyl)-4-(6-phenyl-hexyl)-pyrazolidine-3,5-dione | CHEMBL373076
TypeSmall organic molecule
Emp. Form.C27H26Cl2N2O2
Mol. Mass.481.414
SMILESOc1c(CCCCCCc2ccccc2)c(=O)n(-c2ccc(Cl)cc2)n1-c1ccc(Cl)cc1