Reaction Details
TargetUDP-N-acetylenolpyruvoylglucosamine reductase
LigandBDBM50166497
Substrate/Competitorn/a
Meas. Tech.ChEMBL_304867 (CHEMBL829244)
IC50 11000±n/a nM
Citation Kutterer, KMDavis, JMSingh, GYang, YHu, WSeverin, ARasmussen, BAKrishnamurthy, GFailli, AKatz, AH 4-Alkyl and 4,4'-dialkyl 1,2-bis(4-chlorophenyl)pyrazolidine-3,5-dione derivatives as new inhibitors of bacterial cell wall biosynthesis. Bioorg Med Chem Lett15:2527-31 (2005) 
 
UDP-N-acetylenolpyruvoylglucosamine reductase
Name:UDP-N-acetylenolpyruvoylglucosamine reductase
Type:Protein
Mol. Mass.:33791.48
Organism:Staphylococcus aureus (Firmicutes)
Description:S. aureus MurB
Residue:307
BDBM50166497
NameBDBM50166497
Synonyms:1,2-Bis-(4-chloro-phenyl)-4-[4-(4-fluoro-phenyl)-4-oxo-butyl]-pyrazolidine-3,5-dione | CHEMBL370034
TypeSmall organic molecule
Emp. Form.C25H19Cl2FN2O3
Mol. Mass.485.334
SMILESOc1c(CCCC(=O)c2ccc(F)cc2)c(=O)n(-c2ccc(Cl)cc2)n1-c1ccc(Cl)cc1