Reaction Details
TargetUDP-N-acetylenolpyruvoylglucosamine reductase
LigandBDBM50166501
Substrate/Competitorn/a
Meas. Tech.ChEMBL_304764 (CHEMBL829361)
IC50 12000±n/a nM
Citation Kutterer, KMDavis, JMSingh, GYang, YHu, WSeverin, ARasmussen, BAKrishnamurthy, GFailli, AKatz, AH 4-Alkyl and 4,4'-dialkyl 1,2-bis(4-chlorophenyl)pyrazolidine-3,5-dione derivatives as new inhibitors of bacterial cell wall biosynthesis. Bioorg Med Chem Lett15:2527-31 (2005) 
 
UDP-N-acetylenolpyruvoylglucosamine reductase
Name:UDP-N-acetylenolpyruvoylglucosamine reductase
Type:Protein
Mol. Mass.:37848.05
Organism:Escherichia coli K-12 (Enterobacteria)
Description:E. coli MurB
Residue:342
BDBM50166501
NameBDBM50166501
Synonyms:4-(3,5-Bis-trifluoromethyl-benzyl)-1,2-bis-(4-chloro-phenyl)-pyrazolidine-3,5-dione | CHEMBL192191
TypeSmall organic molecule
Emp. Form.C24H14Cl2F6N2O2
Mol. Mass.547.277
SMILESOc1c(Cc2cc(cc(c2)C(F)(F)F)C(F)(F)F)c(=O)n(-c2ccc(Cl)cc2)n1-c1ccc(Cl)cc1