Reaction Details
TargetEstrogen receptor beta
LigandBDBM50166756
Substrate/Competitorn/a
Meas. Tech.ChEMBL_304718 (CHEMBL827158)
IC50 1.7±n/a nM
Citation McDevitt, REMalamas, MSManas, ESUnwalla, RJXu, ZBMiller, CPHarris, HA Estrogen receptor ligands: design and synthesis of new 2-arylindene-1-ones. Bioorg Med Chem Lett15:3137-42 (2005) 
 
Estrogen receptor beta
Name:Estrogen receptor beta
Type:Protein
Mol. Mass.:59238.43
Organism:Homo sapiens (Human)
Description:Q92731
Residue:530
BDBM50166756
NameBDBM50166756
Synonyms:3-Bromo-5-hydroxy-2-(4-hydroxy-phenyl)-inden-1-one | CHEMBL363872
TypeSmall organic molecule
Emp. Form.C15H9BrO3
Mol. Mass.317.134
SMILESOc1ccc(cc1)C1=C(Br)c2cc(O)ccc2C1=O