Reaction Details
TargetC-C chemokine receptor type 3
LigandBDBM50167454
Substrate/Competitorn/a
Meas. Tech.ChEMBL_303341 (CHEMBL840157)
Ki 30.0±n/a nM
Citation Ting, PCUmland, SPAslanian, RCao, JGarlisi, CGHuang, YJakway, JLiu, ZShah, HTian, FWan, YShih, NY The synthesis of substituted bipiperidine amide compounds as CCR3 ligands: antagonists versus agonists. Bioorg Med Chem Lett15:3020-3 (2005) 
 
C-C chemokine receptor type 3
Name:C-C chemokine receptor type 3
Type:Enzyme
Mol. Mass.:41053.88
Organism:Homo sapiens (Human)
Description:P51677
Residue:355
BDBM50167454
NameBDBM50167454
Synonyms:CHEMBL193354 | Quinoline-8-carboxylic acid [1'-(3,4-dichloro-benzyl)-[1,4']bipiperidinyl-3-ylmethyl]-amide
TypeSmall organic molecule
Emp. Form.C28H32Cl2N4O
Mol. Mass.511.486
SMILESClc1ccc(CN2CCC(CC2)N2CCCC(CNC(=O)c3cccc4cccnc34)C2)cc1Cl