Reaction Details
TargetMelanin-concentrating hormone receptor 1
LigandBDBM50167561
Substrate/Competitorn/a
Meas. Tech.ChEMBL_306352 (CHEMBL828171)
IC50 8.5±n/a nM
Citation Souers, AJGao, JWodka, DJudd, ASMulhern, MMNapier, JJBrune, MEBush, ENBrodjian, SJDayton, BDShapiro, RHernandez, LEMarsh, KCSham, HLCollins, CAKym, PR Synthesis and evaluation of urea-based indazoles as melanin-concentrating hormone receptor 1 antagonists for the treatment of obesity. Bioorg Med Chem Lett15:2752-7 (2005) 
 
Melanin-concentrating hormone receptor 1
Name:Melanin-concentrating hormone receptor 1
Type:PROTEIN
Mol. Mass.:39133.74
Organism:Mus musculus
Description:ChEMBL_818502
Residue:353
BDBM50167561
NameBDBM50167561
Synonyms:1-[1-(3-Cyclopentylamino-propyl)-1H-indazol-5-yl]-3-(4-phenoxy-phenyl)-urea | CHEMBL197210
TypeSmall organic molecule
Emp. Form.C28H31N5O2
Mol. Mass.469.578
SMILESO=C(Nc1ccc(Oc2ccccc2)cc1)Nc1ccc2n(CCCNC3CCCC3)ncc2c1