Reaction Details
TargetDipeptidyl peptidase 8
LigandBDBM11694
Substrate/Competitorn/a
Meas. Tech.ChEMBL_304640 (CHEMBL828523)
IC50 27±n/a nM
Citation Lu, ILLee, SJTsu, HWu, SYKao, KHChien, CHChang, YYChen, YSCheng, JHChang, CNChen, TWChang, SPChen, XJiaang, WT Glutamic acid analogues as potent dipeptidyl peptidase IV and 8 inhibitors. Bioorg Med Chem Lett15:3271-5 (2005) 
 
Dipeptidyl peptidase 8
Name:Dipeptidyl peptidase 8
Type:Enzyme
Mol. Mass.:103342.62
Organism:Homo sapiens (Human)
Description:Q6V1X1
Residue:898
BDBM11694
NameBDBM11694
Synonyms:(2S)-1-[(2S)-2-amino-2-cyclohexylacetyl]pyrrolidine-2-carbonitrile CHEMBL307636 Cyclohexylglycine-(2S)-cyanopyrrolidine 2
TypeSmall organic molecule
Emp. Form.C13H21N3O
Mol. Mass.235.3253
SMILESN[C@@H](C1CCCCC1)C(=O)N1CCC[C@H]1C#N