Reaction Details
TargetDipeptidyl peptidase 8
LigandBDBM50168275
Substrate/Competitorn/a
Meas. Tech.ChEMBL_304640 (CHEMBL828523)
IC50 28±n/a nM
Citation Lu, ILLee, SJTsu, HWu, SYKao, KHChien, CHChang, YYChen, YSCheng, JHChang, CNChen, TWChang, SPChen, XJiaang, WT Glutamic acid analogues as potent dipeptidyl peptidase IV and 8 inhibitors. Bioorg Med Chem Lett15:3271-5 (2005) 
 
Dipeptidyl peptidase 8
Name:Dipeptidyl peptidase 8
Type:Enzyme
Mol. Mass.:103342.62
Organism:Homo sapiens (Human)
Description:Q6V1X1
Residue:898
BDBM50168275
NameBDBM50168275
Synonyms:1-{4-[(S)-3-Amino-4-((S)-2-cyano-pyrrolidin-1-yl)-4-oxo-butyryl]-piperazin-1-yl}-nicotinonitrile | CHEMBL364922
TypeSmall organic molecule
Emp. Form.C19H24N7O2
Mol. Mass.382.439
SMILESN[C@@H](CC(=O)N1CCN(CC1)[n+]1cccc(c1)C#N)C(=O)N1CCC[C@H]1C#N