Reaction Details
TargetGonadotropin-releasing hormone receptor
LigandBDBM50168695
Substrate/Competitorn/a
Meas. Tech.ChEMBL_303748 (CHEMBL829791)
Ki 13±n/a nM
Citation Guo, ZWu, DZhu, YFTucci, FCRegan, CFRowbottom, MWStruthers, RSXie, QReijmers, SSullivan, SKSai, YChen, C Structure-activity relationships of 1,3,5-triazine-2,4,6-triones as human gonadotropin-releasing hormone receptor antagonists. Bioorg Med Chem Lett15:3685-90 (2005) 
 
Gonadotropin-releasing hormone receptor
Name:Gonadotropin-releasing hormone receptor
Type:Enzyme
Mol. Mass.:37749.45
Organism:Homo sapiens (Human)
Description:P30968
Residue:328
BDBM50168695
NameBDBM50168695
Synonyms:2-[3-((R)-2-Amino-2-phenyl-ethyl)-5-(2-fluoro-3-methoxy-phenyl)-2,4,6-trioxo-[1,3,5]triazinan-1-ylmethyl]-benzonitrile | CHEMBL175443
TypeSmall organic molecule
Emp. Form.C26H22FN5O4
Mol. Mass.487.4824
SMILESCOc1cccc(c1F)-n1c(=O)n(C[C@H](N)c2ccccc2)c(=O)n(Cc2ccccc2C#N)c1=O