Reaction Details
TargetGonadotropin-releasing hormone receptor
LigandBDBM50168703
Substrate/Competitorn/a
Meas. Tech.ChEMBL_303748 (CHEMBL829791)
Ki 18±n/a nM
Citation Guo, ZWu, DZhu, YFTucci, FCRegan, CFRowbottom, MWStruthers, RSXie, QReijmers, SSullivan, SKSai, YChen, C Structure-activity relationships of 1,3,5-triazine-2,4,6-triones as human gonadotropin-releasing hormone receptor antagonists. Bioorg Med Chem Lett15:3685-90 (2005) 
 
Gonadotropin-releasing hormone receptor
Name:Gonadotropin-releasing hormone receptor
Type:Enzyme
Mol. Mass.:37749.45
Organism:Homo sapiens (Human)
Description:P30968
Residue:328
BDBM50168703
NameBDBM50168703
Synonyms:1-((R)-2-Amino-2-phenyl-ethyl)-3-(2-fluoro-3-methoxy-phenyl)-5-(2-trifluoromethoxy-benzyl)-[1,3,5]triazinane-2,4,6-trione | CHEMBL425523
TypeSmall organic molecule
Emp. Form.C26H22F4N4O5
Mol. Mass.546.4703
SMILESCOc1cccc(c1F)-n1c(=O)n(C[C@H](N)c2ccccc2)c(=O)n(Cc2ccccc2OC(F)(F)F)c1=O