Reaction Details
TargetGonadotropin-releasing hormone receptor
LigandBDBM50168719
Substrate/Competitorn/a
Meas. Tech.ChEMBL_303748 (CHEMBL829791)
Ki 28±n/a nM
Citation Guo, ZWu, DZhu, YFTucci, FCRegan, CFRowbottom, MWStruthers, RSXie, QReijmers, SSullivan, SKSai, YChen, C Structure-activity relationships of 1,3,5-triazine-2,4,6-triones as human gonadotropin-releasing hormone receptor antagonists. Bioorg Med Chem Lett15:3685-90 (2005) 
 
Gonadotropin-releasing hormone receptor
Name:Gonadotropin-releasing hormone receptor
Type:Enzyme
Mol. Mass.:37749.45
Organism:Homo sapiens (Human)
Description:P30968
Residue:328
BDBM50168719
NameBDBM50168719
Synonyms:1-(3-Amino-2-phenyl-propyl)-3-(2,6-difluoro-benzyl)-5-(3-methoxy-phenyl)-[1,3,5]triazinane-2,4,6-trione | CHEMBL177523
TypeSmall organic molecule
Emp. Form.C26H24F2N4O4
Mol. Mass.494.49
SMILESCOc1cccc(c1)-n1c(=O)n(CC(CN)c2ccccc2)c(=O)n(Cc2c(F)cccc2F)c1=O