Reaction Details
TargetMelanocortin receptor 5
LigandBDBM50168724
Substrate/Competitorn/a
Meas. Tech.ChEMBL_306603 (CHEMBL832207)
IC50 64±n/a nM
Citation Bakshi, RKHong, QOlson, JTYe, ZSebhat, IKWeinberg, DHMacNeil, TKalyani, RNTang, RMartin, WJStrack, AMcGowan, ETamvakopoulos, CMiller, RRStearns, RATang, WMaclntyre, DEvan der Ploeg, LHPatchett, AANargund, RP 1-Amino-1,2,3,4-tetrahydronaphthalene-2-carboxylic acid as a Tic mimetic: application in the synthesis of potent human melanocortin-4 receptor selective agonists. Bioorg Med Chem Lett15:3430-3 (2005) 
 
Melanocortin receptor 5
Name:Melanocortin receptor 5
Type:Enzyme
Mol. Mass.:36612.92
Organism:Homo sapiens (Human)
Description:P33032
Residue:325
BDBM50168724
NameBDBM50168724
Synonyms:1-[(R)-2-[((1S,2S)-1-Amino-1,2,3,4-tetrahydro-naphthalene-2-carbonyl)-amino]-3-(4-chloro-phenyl)-propionyl]-4-cyclohexyl-piperidine-4-carboxylic acid tert-butylamide | CHEMBL433764
TypeSmall organic molecule
Emp. Form.C36H49ClN4O3
Mol. Mass.621.252
SMILESCC(C)(C)NC(=O)C1(CCN(CC1)C(=O)[C@@H](Cc1ccc(Cl)cc1)NC(=O)[C@H]1CCc2ccccc2[C@H]1N)C1CCCCC1