Reaction Details
TargetMyeloperoxidase
LigandBDBM50595661
Substrate/Competitorn/a
Meas. Tech.ChEMBL_2217367 (CHEMBL5130499)
IC50 5.00±n/a nM
Citation Inghardt, TAntonsson, TEricsson, CHovdal, DJohannesson, PJohansson, CJurva, UKajanus, JKull, BMichaëlsson, EPettersen, ASjögren, TSörensen, HWesterlund, KLindstedt, EL Discovery of AZD4831, a Mechanism-Based Irreversible Inhibitor of Myeloperoxidase, As a Potential Treatment for Heart Failure with Preserved Ejection Fraction. J Med Chem65:11485-11496 (2022) 
 
Myeloperoxidase
Name:Myeloperoxidase
Type:Enzyme
Mol. Mass.:83888.32
Organism:Homo sapiens (Human)
Description:P05164
Residue:745
BDBM50595661
NameBDBM50595661
Synonyms:CHEMBL5197968
TypeSmall organic molecule
Emp. Form.C20H18N4OS
Mol. Mass.362.448
SMILESNC(c1ccccc1)c1ccccc1Cn1c2cc[nH]c2c(=O)[nH]c1=S