Reaction Details
TargetMu-type opioid receptor
LigandBDBM50170678
Substrate/Competitorn/a
Meas. Tech.ChEMBL_302757 (CHEMBL838703)
Ki 12±n/a nM
Citation Harding, WWTidgewell, KByrd, NCobb, HDersch, CMButelman, ERRothman, RBPrisinzano, TE Neoclerodane diterpenes as a novel scaffold for mu opioid receptor ligands. J Med Chem48:4765-71 (2005) 
 
Mu-type opioid receptor
Name:Mu-type opioid receptor
Type:G Protein-Coupled Receptor (GPCR)
Mol. Mass.:44789.51
Organism:Homo sapiens (Human)
Description:P35372
Residue:400
BDBM50170678
NameBDBM50170678
Synonyms:(3S,4aR,4bS,6S,8R,8aR,10aR)-6-Benzoyloxy-3-furan-3-yl-4a,8a-dimethyl-1,5-dioxo-dodecahydro-2-oxa-phenanthrene-8-carboxylic acid methyl ester HERKINORIN
TypeSmall organic molecule
Emp. Form.C28H30O8
Mol. Mass.494.533
SMILESCOC(=O)[C@@H]1C[C@H](OC(=O)c2ccccc2)C(=O)[C@H]2[C@@]1(C)CC[C@H]1C(=O)O[C@@H](C[C@]21C)c1ccoc1