Reaction Details
TargetKappa-type opioid receptor
LigandBDBM50170671
Substrate/Competitorn/a
Meas. Tech.ChEMBL_302816 (CHEMBL839506)
Ki 430±n/a nM
Citation Harding, WWTidgewell, KByrd, NCobb, HDersch, CMButelman, ERRothman, RBPrisinzano, TE Neoclerodane diterpenes as a novel scaffold for mu opioid receptor ligands. J Med Chem48:4765-71 (2005) 
 
Kappa-type opioid receptor
Name:Kappa-type opioid receptor
Type:G Protein-Coupled Receptor (GPCR)
Mol. Mass.:42648.76
Organism:Homo sapiens (Human)
Description:P41145
Residue:380
BDBM50170671
NameBDBM50170671
Synonyms:CHEMBL360404 | Oxalic acid (3S,4aR,4bS,6S,8R,8aR,10aR)-3-furan-3-yl-8-methoxycarbonyl-4a,8a-dimethyl-1,5-dioxo-dodecahydro-2-oxa-phenanthren-6-yl ester methyl ester
TypeSmall organic molecule
Emp. Form.C24H28O10
Mol. Mass.476.4731
SMILESCOC(=O)[C@@H]1C[C@H](OC(=O)C(=O)OC)C(=O)[C@H]2[C@@]1(C)CC[C@H]1C(=O)O[C@@H](C[C@]21C)c1ccoc1