Reaction Details
TargetSubstance-K receptor
LigandBDBM50409627
Substrate/Competitorn/a
Meas. Tech.ChEMBL_307257 (CHEMBL829162)
IC50 0.79±n/a nM
Citation Middleton, DSMacKenzie, ARNewman, SDCorless, MWarren, AMarchington, APJones, B Structure-activity relationships of 1-alkyl-5-(3,4-dichlorophenyl)-5-{2-[3-(substituted)-1-azetidinyl]-ethyl}-2-piperidones. Part 2: Improving oral absorption. Bioorg Med Chem Lett15:3957-61 (2005) 
 
Substance-K receptor
Name:Substance-K receptor
Type:Protein
Mol. Mass.:44455.78
Organism:Homo sapiens (Human)
Description:P21452
Residue:398
BDBM50409627
NameBDBM50409627
Synonyms:CHEMBL185572
TypeSmall organic molecule
Emp. Form.C27H39Cl2N3O2
Mol. Mass.508.523
SMILESClc1ccc(cc1Cl)[C@@]1(CCN2CC(C2)N2CCOCC2)CCC(=O)N(CC2CCCCC2)C1