Reaction Details
TargetCorticotropin-releasing factor receptor 1
LigandBDBM50171322
Substrate/Competitorn/a
Meas. Tech.ChEMBL_303781 (CHEMBL830138)
Ki 5.1±n/a nM
Citation Guo, ZTellew, JEGross, RSDyck, BGrey, JHaddach, MKiankarimi, MLanier, MLi, BFLuo, ZMcCarthy, JRMoorjani, MSaunders, JSullivan, RZhang, XZamani-Kord, SGrigoriadis, DECrowe, PDChen, TKWilliams, JP Design and synthesis of tricyclic imidazo[4,5-b]pyridin-2-ones as corticotropin-releasing factor-1 antagonists. J Med Chem48:5104-7 (2005) 
 
Corticotropin-releasing factor receptor 1
Name:Corticotropin-releasing factor receptor 1
Type:Enzyme
Mol. Mass.:50744.31
Organism:Homo sapiens (Human)
Description:P34998
Residue:444
BDBM50171322
NameBDBM50171322
Synonyms:1-(2,4-Dichloro-phenyl)-7-methyl-5-(1-propyl-butyl)-4,5-dihydro-1H,3H-1,2a,5,8-tetraaza-acenaphthylen-2-one | CHEMBL190488
TypeSmall organic molecule
Emp. Form.C22H26Cl2N4O
Mol. Mass.433.374
SMILESCCCC(CCC)N1CCn2c3c1cc(C)nc3n(-c1ccc(Cl)cc1Cl)c2=O