Reaction Details
TargetCorticotropin-releasing factor receptor 1
LigandBDBM50171332
Substrate/Competitorn/a
Meas. Tech.ChEMBL_303781 (CHEMBL830138)
Ki 1.1±n/a nM
Citation Guo, ZTellew, JEGross, RSDyck, BGrey, JHaddach, MKiankarimi, MLanier, MLi, BFLuo, ZMcCarthy, JRMoorjani, MSaunders, JSullivan, RZhang, XZamani-Kord, SGrigoriadis, DECrowe, PDChen, TKWilliams, JP Design and synthesis of tricyclic imidazo[4,5-b]pyridin-2-ones as corticotropin-releasing factor-1 antagonists. J Med Chem48:5104-7 (2005) 
 
Corticotropin-releasing factor receptor 1
Name:Corticotropin-releasing factor receptor 1
Type:Enzyme
Mol. Mass.:50744.31
Organism:Homo sapiens (Human)
Description:P34998
Residue:444
BDBM50171332
NameBDBM50171332
Synonyms:1-(2-Bromo-4-isopropyl-phenyl)-7-methyl-5-(1-propyl-butyl)-4,5-dihydro-1H,3H-1,2a,5,8-tetraaza-acenaphthylen-2-one | CHEMBL191090
TypeSmall organic molecule
Emp. Form.C25H33BrN4O
Mol. Mass.485.46
SMILESCCCC(CCC)N1CCn2c3c1cc(C)nc3n(-c1ccc(cc1Br)C(C)C)c2=O