Reaction Details
TargetSphingosine 1-phosphate receptor 2
LigandBDBM50158336
Substrate/Competitorn/a
Meas. Tech.ChEMBL_304342 (CHEMBL839768)
pH7.4±n/a
EC50>10000±n/a nM
Commentsextracted
Citation Albert, RHinterding, KBrinkmann, VGuerini, DMüller-Hartwieg, CKnecht, HSimeon, CStreiff, MWagner, TWelzenbach, KZécri, FZollinger, MCooke, NFrancotte, E Novel immunomodulator FTY720 is phosphorylated in rats and humans to form a single stereoisomer. Identification, chemical proof, and biological characterization of the biologically active species and its enantiomer. J Med Chem48:5373-7 (2005) 
 
Sphingosine 1-phosphate receptor 2
Name:Sphingosine 1-phosphate receptor 2
Type:G Protein-Coupled Receptor (GPCR)
Mol. Mass.:38883.16
Organism:Homo sapiens (Human)
Description:Membranes isolated from S1P2-transfected CHO cells were used in ligand binding assay.
Residue:353
BDBM50158336
NameBDBM50158336
Synonyms:2-(4-octylphenethyl)-2-aminopropane-1,3-diol 2-amino-2-(4-octylphenethyl)propane-1,3-diol CHEMBL314854 FINGOLIMOD HYDROCHLORIDE
TypeSmall organic molecule
Emp. Form.C19H33NO2
Mol. Mass.307.4708
SMILESCCCCCCCCc1ccc(CCC(N)(CO)CO)cc1