Reaction Details
TargetSphingosine 1-phosphate receptor 4
LigandBDBM23165
Substrate/Competitorn/a
Meas. Tech.ChEMBL_304344 (CHEMBL839770)
pH7.4±n/a
EC50 0.60±n/a nM
Commentsextracted
Citation Albert, RHinterding, KBrinkmann, VGuerini, DMüller-Hartwieg, CKnecht, HSimeon, CStreiff, MWagner, TWelzenbach, KZécri, FZollinger, MCooke, NFrancotte, E Novel immunomodulator FTY720 is phosphorylated in rats and humans to form a single stereoisomer. Identification, chemical proof, and biological characterization of the biologically active species and its enantiomer. J Med Chem48:5373-7 (2005) 
 
Sphingosine 1-phosphate receptor 4
Name:Sphingosine 1-phosphate receptor 4
Type:G Protein-Coupled Receptor (GPCR)
Mol. Mass.:41647.39
Organism:Homo sapiens (Human)
Description:n/a
Residue:384
BDBM23165
NameBDBM23165
Synonyms:CHEMBL366208 [(2S)-2-amino-3-hydroxy-2-[2-(4-octylphenyl)ethyl]propoxy]phosphonic acid
TypeSmall organic molecule
Emp. Form.C19H34NO5P
Mol. Mass.387.4507
SMILESCCCCCCCCc1ccc(CC[C@](N)(CO)COP(O)(O)=O)cc1