Reaction Details
TargetMelanin-concentrating hormone receptor 1
LigandBDBM50171577
Substrate/Competitorn/a
Meas. Tech.ChEMBL_322368 (CHEMBL855227)
IC50 9±n/a nM
Citation Vasudevan, ALaMarche, MJBlackburn, CChe, JLLuchaco-Cullis, CALai, SMarsilje, THPatane, MASouers, AJWodka, DGeddes, BChen, SBrodjian, SFalls, DHDayton, BDBush, EBrune, MShapiro, RDMarsh, KCHernandez, LESham, HLCollins, CAKym, PR Identification of ortho-amino benzamides and nicotinamides as MCHr1 antagonists. Bioorg Med Chem Lett15:4174-9 (2005) 
 
Melanin-concentrating hormone receptor 1
Name:Melanin-concentrating hormone receptor 1
Type:G Protein-Coupled Receptor (GPCR)
Mol. Mass.:45976.27
Organism:Homo sapiens (Human)
Description:Membranes from CHO-K1 cells stably expressing human MCH1R were used in assays.
Residue:422
BDBM50171577
NameBDBM50171577
Synonyms:CHEMBL196681 | N-(1-Benzo[1,3]dioxol-5-ylmethyl-piperidin-4-yl)-5-chloro-2-[(thiazol-2-ylmethyl)-amino]-nicotinamide
TypeSmall organic molecule
Emp. Form.C23H24ClN5O3S
Mol. Mass.485.986
SMILESClc1cnc(NCc2nccs2)c(c1)C(=O)NC1CCN(Cc2ccc3OCOc3c2)CC1