Reaction Details
TargetMitogen-activated protein kinase 10
LigandBDBM50173169
Substrate/Competitorn/a
Meas. Tech.ChEMBL_321351 (CHEMBL881495)
IC50 3±n/a nM
Citation Graczyk, PPKhan, ABhatia, GSPalmer, VMedland, DNumata, HOinuma, HCatchick, JDunne, AEllis, MSmales, CWhitfield, JNeame, SJShah, BWilton, DMorgan, LPatel, TChung, RDesmond, HStaddon, JMSato, NInoue, A The neuroprotective action of JNK3 inhibitors based on the 6,7-dihydro-5H-pyrrolo[1,2-a]imidazole scaffold. Bioorg Med Chem Lett15:4666-70 (2005) 
 
Mitogen-activated protein kinase 10
Name:Mitogen-activated protein kinase 10
Type:Enzyme
Mol. Mass.:52586.89
Organism:Homo sapiens (Human)
Description:n/a
Residue:464
BDBM50173169
NameBDBM50173169
Synonyms:CHEMBL383799 | [(R)-2-(4-Fluoro-phenyl)-3-(2-propylamino-pyrimidin-4-yl)-6,7-dihydro-5H-pyrrolo[1,2-a]imidazol-5-yl]-methanol
TypeSmall organic molecule
Emp. Form.C20H22FN5O
Mol. Mass.367.42
SMILESCCCNc1nccc(n1)-c1c(nc2CC[C@H](CO)n12)-c1ccc(F)cc1