Reaction Details
TargetDelta-type opioid receptor
LigandBDBM50173245
Substrate/Competitorn/a
Meas. Tech.ChEMBL_321479 (CHEMBL880420)
IC50>10000±n/a nM
Citation Bignan, GCBattista, KConnolly, PJOrsini, MJLiu, JMiddleton, SAReitz, AB Preparation of 3-spirocyclic indolin-2-ones as ligands for the ORL-1 receptor. Bioorg Med Chem Lett15:5022-6 (2005) 
 
Delta-type opioid receptor
Name:Delta-type opioid receptor
Type:G Protein-Coupled Receptor (GPCR)
Mol. Mass.:40382.98
Organism:Homo sapiens (Human)
Description:Competition binding assays were carried out using membrane preparations from transfected HN9.10 cells that constitutively expressed the delta opioid receptor.
Residue:372
BDBM50173245
NameBDBM50173245
Synonyms:1'-cyclooctylmethyl-5-fluoro-1-methylspiro[2,3-dihydro-1H-indole-3,4'-(hexahydropyridine)]-2-one | CHEMBL197727
TypeSmall organic molecule
Emp. Form.C22H31FN2O
Mol. Mass.358.4927
SMILESCN1C(=O)C2(CCN(CC3CCCCCCC3)CC2)c2cc(F)ccc12