Reaction Details
TargetDelta-type opioid receptor
LigandBDBM50173255
Substrate/Competitorn/a
Meas. Tech.ChEMBL_321479 (CHEMBL880420)
IC50>10000±n/a nM
Citation Bignan, GCBattista, KConnolly, PJOrsini, MJLiu, JMiddleton, SAReitz, AB Preparation of 3-spirocyclic indolin-2-ones as ligands for the ORL-1 receptor. Bioorg Med Chem Lett15:5022-6 (2005) 
 
Delta-type opioid receptor
Name:Delta-type opioid receptor
Type:G Protein-Coupled Receptor (GPCR)
Mol. Mass.:40382.98
Organism:Homo sapiens (Human)
Description:Competition binding assays were carried out using membrane preparations from transfected HN9.10 cells that constitutively expressed the delta opioid receptor.
Residue:372
BDBM50173255
NameBDBM50173255
Synonyms:1'-cyclooctylmethyl-6-methoxy-1-methylspiro[2,3-dihydro-1H-indole-3,4'-(hexahydropyridine)]-2-one | CHEMBL381429
TypeSmall organic molecule
Emp. Form.C23H34N2O2
Mol. Mass.370.5283
SMILESCOc1ccc2c(c1)N(C)C(=O)C21CCN(CC2CCCCCCC2)CC1